Reaction Details
TargetTransient receptor potential cation channel subfamily V member 1
LigandBDBM29082
Substrate/CompetitorBDBM10852
Meas. Tech.TRPV1 Channel Activity Assay
EC50 60±n/a nM
Citation Appendino, GLigresti, AMinassi, ACascio, MGAllarà, MTaglialatela-Scafati, OPertwee, RGDe Petrocellis, LDi Marzo, V Conformationally constrained fatty acid ethanolamides as cannabinoid and vanilloid receptor probes. J Med Chem52:3001-9 (2009) 
 
Transient receptor potential cation channel subfamily V member 1
Name:Transient receptor potential cation channel subfamily V member 1
Type:Protein
Mol. Mass.:94960.75
Organism:Homo sapiens (Human)
Description:Q8NER1
Residue:839
BDBM29082
BDBM10852
NameBDBM29082
Synonyms:cyclopropanolamide, 12b racemic
TypeSmall organic molecule
Emp. Form.C21H39NO2
Mol. Mass.337.5399
SMILESCCCCCCCC\C=C/CCCCCCCC(=O)N[C@@H]1C[C@H]1O