Reaction Details
TargetProthrombin
LigandBDBM29363
Substrate/CompetitorBDBM13573
Meas. Tech.Surface Plasmon Resonance (SPR)-Based Biosensor Measurements (KD) and Enzyme Inhibition Assay (IC50)
pH7.4±n/a
Temperature310.15±n/a K
IC50>400000±n/a nM
Kd 1000000±n/a nM
Citation Nilsson, MHämäläinen, MIvarsson, MGottfries, JXue, YHansson, SIsaksson, RFex, T Compounds binding to the S2-S3 pockets of thrombin. J Med Chem52:2708-15 (2009) 
 
Prothrombin
Name:Prothrombin
Type:Protein
Mol. Mass.:70029.57
Organism:Homo sapiens (Human)
Description:P00734
Residue:622
BDBM29363
BDBM13573
NameBDBM29363
Synonyms:proline scaffold, 12
TypeSmall organic molecule
Emp. Form.C18H26N2O2S
Mol. Mass.334.476
SMILESO=C(CC1CCCCC1)N1CCC[C@H]1C(=O)NCc1cccs1