Reaction Details
TargetProthrombin
LigandBDBM29381
Substrate/CompetitorBDBM13573
Meas. Tech.Surface Plasmon Resonance (SPR)-Based Biosensor Measurements (KD) and Enzyme Inhibition Assay (IC50)
IC50 120000±n/a nM
Kd 27000±n/a nM
Citation Nilsson, MHämäläinen, MIvarsson, MGottfries, JXue, YHansson, SIsaksson, RFex, T Compounds binding to the S2-S3 pockets of thrombin. J Med Chem52:2708-15 (2009) 
 
Prothrombin
Name:Prothrombin
Type:Protein
Mol. Mass.:70029.57
Organism:Homo sapiens (Human)
Description:P00734
Residue:622
BDBM29381
BDBM13573
NameBDBM29381
Synonyms:proline scaffold, 30
TypeSmall organic molecule
Emp. Form.C16H29N3O2
Mol. Mass.295.4204
SMILESCCCNC(=O)[C@@H]1CCCN1C(=O)[C@H](N)C1CCCCC1