Reaction Details
TargetProthrombin
LigandBDBM29383
Substrate/CompetitorBDBM13573
Meas. Tech.Surface Plasmon Resonance (SPR)-Based Biosensor Measurements (KD) and Enzyme Inhibition Assay (IC50)
IC50 4200±n/a nM
Kd 1100±n/a nM
Citation Nilsson, MHämäläinen, MIvarsson, MGottfries, JXue, YHansson, SIsaksson, RFex, T Compounds binding to the S2-S3 pockets of thrombin. J Med Chem52:2708-15 (2009) 
 
Prothrombin
Name:Prothrombin
Type:Protein
Mol. Mass.:70029.57
Organism:Homo sapiens (Human)
Description:P00734
Residue:622
BDBM29383
BDBM13573
NameBDBM29383
Synonyms:proline scaffold, 32
TypeSmall organic molecule
Emp. Form.C18H27N3O2S
Mol. Mass.349.491
SMILESN[C@H](C1CCCCC1)C(=O)N1CCC[C@H]1C(=O)NCc1cccs1