Reaction Details
Target5-hydroxytryptamine receptor 1A
LigandBDBM29546
Substrate/CompetitorBDBM21393
Meas. Tech.Radioligand Binding Assay (Ki)
pH7.4±n/a
Temperature310.15±n/a K
Ki 3.4±n/a nM
Citation Badarau, ESuzenet, FBojarski, AJFînaru, ALGuillaumet, G Benzimidazolone-based serotonin 5-HT1A or 5-HT7R ligands: synthesis and biological evaluation. Bioorg Med Chem Lett19:1600-3 (2009) 
 
5-hydroxytryptamine receptor 1A
Name:5-hydroxytryptamine receptor 1A
Type:G Protein-Coupled Receptor (GPCR)
Mol. Mass.:46445.29
Organism:Rattus norvegicus (rat)
Description:Binding assays were performed using rat hippocampal membranes.
Residue:422
BDBM29546
BDBM21393
NameBDBM29546
Synonyms:benzimidazolone scaffold, 15d
TypeSmall organic molecule
Emp. Form.C21H26N4O2
Mol. Mass.366.4567
SMILESCOc1ccccc1N1CCN(CCCn2c3ccccc3[nH]c2=O)CC1