Reaction Details
TargetMitotic checkpoint serine/threonine-protein kinase BUB1
LigandBDBM395255
Substrate/Competitorn/a
Meas. Tech.Bub1 Kinase Assay
IC50 5.00±n/a nM
Citation Graham, KKlar, UBriem, HSiemeister, GMönning, U 1H-pyrrol-3-amines US Patent US10308629 Publication Date 6/4/2019
 
Mitotic checkpoint serine/threonine-protein kinase BUB1
Name:Mitotic checkpoint serine/threonine-protein kinase BUB1
Type:PROTEIN
Mol. Mass.:122372.31
Organism:Homo sapiens (Human)
Description:ChEMBL_1510603
Residue:1085
BDBM395255
NameBDBM395255
Synonyms:(4aR,5aR or 4aS,5aS)-5a-Methyl-3-(phenylamino)-2-(pyridin-4-yl)-4a,5,5a,6-tetrahydrocyclopropa[f]indol-4(1H)-one | US10308629, Example 17
TypeSmall organic molecule
Emp. Form.C21H19N3O
Mol. Mass.329.3951
SMILESC[C@]12C[C@H]1C(=O)c1c(C2)[nH]c(c1Nc1ccccc1)-c1ccncc1