Reaction Details
TargetMitotic checkpoint serine/threonine-protein kinase BUB1
LigandBDBM395280
Substrate/Competitorn/a
Meas. Tech.Bub1 Kinase Assay
IC50 5.00±n/a nM
Citation Graham, KKlar, UBriem, HSiemeister, GMönning, U 1H-pyrrol-3-amines US Patent US10308629 Publication Date 6/4/2019
 
Mitotic checkpoint serine/threonine-protein kinase BUB1
Name:Mitotic checkpoint serine/threonine-protein kinase BUB1
Type:PROTEIN
Mol. Mass.:122372.31
Organism:Homo sapiens (Human)
Description:ChEMBL_1510603
Residue:1085
BDBM395280
NameBDBM395280
Synonyms:N-4-[[(4aS,5aS) or (4aR,5aR)]-5a-Methyl-4-oxo-3-(phenylamino)-1,4,4a,5,5a,6-hexahydrocyclopropa[f]indol-2-yl]pyridin-2-yl-1H-pyrazole-3-carboxamide US10308629, Example 45
TypeSmall organic molecule
Emp. Form.C25H22N6O2
Mol. Mass.438.4812
SMILESC[C@@]12C[C@@H]1C(=O)c1c(C2)[nH]c(c1Nc1ccccc1)-c1ccnc(NC(=O)c2cc[nH]n2)c1