Reaction Details
Target11-beta-hydroxysteroid dehydrogenase 1
LigandBDBM29839
Substrate/CompetitorBDBM13739
Meas. Tech.11beta-HSD1 Homogeneous Time-Resolved Fluorescence (HTRF) Assay
pH7.4±n/a
Temperature310.15±n/a K
IC50 1.5±n/a nM
Citation Lepifre, FChristmann-Franck, SRoche, DLeriche, CCarniato, DCharon, CBozec, SDoare, LSchmidlin, FLecomte, MValeur, E Discovery and structure-guided drug design of inhibitors of 11beta-hydroxysteroid-dehydrogenase type I based on a spiro-carboxamide scaffold. Bioorg Med Chem Lett19:3682-5 (2009) 
 
11-beta-hydroxysteroid dehydrogenase 1
Name:11-beta-hydroxysteroid dehydrogenase 1
Type:Enzyme
Mol. Mass.:32409.16
Organism:Homo sapiens (Human)
Description:P28845
Residue:292
BDBM29839
BDBM13739
NameBDBM29839
Synonyms:spiro-carboxamide scaffold, 12
TypeSmall organic molecule
Emp. Form.C19H27NO
Mol. Mass.285.4238
SMILESCC(C)(C(=O)N1CCC2(C1)CCCCC2)c1ccccc1