Reaction Details
TargetNociceptin receptor
LigandBDBM29986
Substrate/CompetitorBDBM29961
Meas. Tech.In Vitro Binding Assay (IC50) and In Vitro Agonism/Antagonism Measurements (EC50/IC50)
IC50 0.52±n/a nM
EC50 0.31±n/a nM
Citation Kobayashi, KUchiyama, MIto, HTakahashi, HYoshizumi, TSakoh, HNagatomi, YAsai, MMiyazoe, HTsujita, THirayama, MOzaki, STani, TIshii, YOhta, HOkamoto, O Discovery of novel arylpyrazole series as potent and selective opioid receptor-like 1 (ORL1) antagonists. Bioorg Med Chem Lett19:3627-31 (2009) 
 
Nociceptin receptor
Name:Nociceptin receptor
Type:G Protein-Coupled Receptor (GPCR)
Mol. Mass.:40702.87
Organism:Homo sapiens (Human)
Description:P41146
Residue:370
BDBM29986
BDBM29961
NameBDBM29986
Synonyms:arylpyrazole, 31
TypeSmall organic molecule
Emp. Form.C21H22ClF2N5
Mol. Mass.417.883
SMILESCc1c(CN[C@H]2CC[C@@H](F)C2)nn(c1-c1cnc(C)c(F)c1)-c1ncccc1Cl