Reaction Details
TargetE3 ubiquitin-protein ligase Mdm2
LigandBDBM31283
Substrate/CompetitorBDBM10852
Meas. Tech.NMR Titration Experiment
pH7.4±n/a
Temperature296.15±n/a K
Kd 270000±n/a nM
Citation Stoll, RRenner, CHansen, SPalme, SKlein, CBelling, AZeslawski, WKamionka, MRehm, TMühlhahn, PSchumacher, RHesse, FKaluza, BVoelter, WEngh, RAHolak, TA Chalcone derivatives antagonize interactions between the human oncoprotein MDM2 and p53. Biochemistry40:336-44 (2001) 
 
E3 ubiquitin-protein ligase Mdm2
Name:E3 ubiquitin-protein ligase Mdm2
Type:Oncoprotein
Mol. Mass.:55196.54
Organism:Homo sapiens (Human)
Description:Q00987
Residue:491
BDBM31283
BDBM10852
NameBDBM31283
Synonyms:Chalcone derivative, N
TypeSmall organic molecule
Emp. Form.C21H14Br2O4
Mol. Mass.490.141
SMILESOC(=O)COc1c(Br)cc(\C=C\C(=O)c2ccc3ccccc3c2)cc1Br