Reaction Details
TargetCytochrome P450 3A1
LigandBDBM31656
Substrate/Competitorerythromycin
IC50 7000±n/a nM
Citation Vlahakis, JZHum, MRahman, MNJia, ZNakatsu, KSzarek, WA Synthesis and evaluation of imidazole-dioxolane compounds as selective heme oxygenase inhibitors: effect of substituents at the 4-position of the dioxolane ring. Bioorg Med Chem17:2461-75 (2009) 
 
Cytochrome P450 3A1
Name:Cytochrome P450 3A1
Type:Enzyme
Mol. Mass.:57928.74
Organism:Rattus norvegicus (rat)
Description:CYP3A1/3A2 prepared from rat liver microsomes was used in enzyme assays.
Residue:504
BDBM31656
erythromycin
NameBDBM31656
Synonyms:imidazole-dioxolane, 8
TypeSmall organic molecule
Emp. Form.C21H22ClN3O2S
Mol. Mass.415.936
SMILESClc1ccc(CC[C@@]2(Cn3ccnc3)OC[C@@H](CSc3ccncc3)O2)cc1