Reaction Details
TargetCytochrome P450 3A1
LigandBDBM31682
Substrate/Competitorerythromycin
IC50 4000±n/a nM
Citation Vlahakis, JZHum, MRahman, MNJia, ZNakatsu, KSzarek, WA Synthesis and evaluation of imidazole-dioxolane compounds as selective heme oxygenase inhibitors: effect of substituents at the 4-position of the dioxolane ring. Bioorg Med Chem17:2461-75 (2009) 
 
Cytochrome P450 3A1
Name:Cytochrome P450 3A1
Type:Enzyme
Mol. Mass.:57928.74
Organism:Rattus norvegicus (rat)
Description:CYP3A1/3A2 prepared from rat liver microsomes was used in enzyme assays.
Residue:504
BDBM31682
erythromycin
NameBDBM31682
Synonyms:imidazole-dioxolane, 32
TypeSmall organic molecule
Emp. Form.C16H18ClFN2O2
Mol. Mass.324.778
SMILESFC[C@@H]1CO[C@@](CCc2ccc(Cl)cc2)(Cn2ccnc2)O1