Reaction Details
TargetThymidylate synthase
LigandBDBM31788
Substrate/CompetitorBDBM18754
Meas. Tech.Thymidylate Synthase (TS) Assay
pH7.4±n/a
Temperature303.15±n/a K
IC50 2300±n/a nM
Citation Gangjee, ALi, WKisliuk, RLCody, VPace, JPiraino, JMakin, J Design, synthesis, and X-ray crystal structure of classical and nonclassical 2-amino-4-oxo-5-substituted-6-ethylthieno[2,3-d]pyrimidines as dual thymidylate synthase and dihydrofolate reductase inhibitors and as potential antitumor agents. J Med Chem52:4892-902 (2009) 
 
Thymidylate synthase
Name:Thymidylate synthase
Type:Enzyme
Mol. Mass.:30475.81
Organism:Escherichia coli
Description:n/a
Residue:264
BDBM31788
BDBM18754
NameBDBM31788
Synonyms:thieno[2,3-d]pyrimidine deriv., 2k
TypeSmall organic molecule
Emp. Form.C14H12ClN3OS2
Mol. Mass.337.848
SMILESCCc1sc2nc(N)[nH]c(=O)c2c1Sc1cccc(Cl)c1