Reaction Details
TargetRetinoic acid receptor gamma [183-417]
LigandBDBM31885
Substrate/CompetitorBDBM31883
Meas. Tech.Retinoid Competition Binding Assay
pH7.9±n/a
Temperature277.15±n/a K
Kd 64±n/a nM
Citation Klaholz, BPMitschler, AMoras, D Structural basis for isotype selectivity of the human retinoic acid nuclear receptor. J Mol Biol302:155-70 (2000) 
 
Retinoic acid receptor gamma [183-417]
Name:Retinoic acid receptor gamma [183-417]
Type:Ligand-binding domain
Mol. Mass.:26502.27
Organism:Homo sapiens (Human)
Description:P13631[183-417]
Residue:235
BDBM31885
BDBM31883
NameBDBM31885
Synonyms:BMS184394 | CHEMBL82089
TypeSmall organic molecule
Emp. Form.C26H28O3
Mol. Mass.388.4987
SMILESCC1(C)CCC(C)(C)c2cc(ccc12)C(O)c1ccc2cc(ccc2c1)C(O)=O