Reaction Details
TargetHeat shock 70 kDa protein 1A
LigandBDBM32374
Substrate/CompetitorBDBM32369
Meas. Tech.HSP70 Fluorescence Polarization Assay
pH7.4±n/a
Temperature296.15±n/a K
IC50 4900±n/a nM
Citation Williamson, DSBorgognoni, JClay, ADaniels, ZDokurno, PDrysdale, MJFoloppe, NFrancis, GLGraham, CJHowes, RMacias, ATMurray, JBParsons, RShaw, TSurgenor, AETerry, LWang, YWood, MMassey, AJ Novel adenosine-derived inhibitors of 70 kDa heat shock protein, discovered through structure-based design. J Med Chem52:1510-3 (2009) 
 
Heat shock 70 kDa protein 1A
Name:Heat shock 70 kDa protein 1A
Type:Chaperone
Mol. Mass.:70043.82
Organism:Homo sapiens (Human)
Description:n/a
Residue:641
BDBM32374
BDBM32369
NameBDBM32374
Synonyms:adenosine-derived inhibitor, 8
TypeSmall organic molecule
Emp. Form.C18H20N6O6
Mol. Mass.416.388
SMILESNc1ncnc2n([C@@H]3O[C@H](CO)[C@@H](O)[C@H]3O)c(NCc3ccc4OCOc4c3)nc12