Reaction Details
TargetHeat shock 70 kDa protein 1A
LigandBDBM32380
Substrate/CompetitorBDBM32369
Meas. Tech.HSP70 Fluorescence Polarization Assay
pH7.4±n/a
Temperature296.15±n/a K
IC50 1700±n/a nM
Citation Williamson, DSBorgognoni, JClay, ADaniels, ZDokurno, PDrysdale, MJFoloppe, NFrancis, GLGraham, CJHowes, RMacias, ATMurray, JBParsons, RShaw, TSurgenor, AETerry, LWang, YWood, MMassey, AJ Novel adenosine-derived inhibitors of 70 kDa heat shock protein, discovered through structure-based design. J Med Chem52:1510-3 (2009) 
 
Heat shock 70 kDa protein 1A
Name:Heat shock 70 kDa protein 1A
Type:Chaperone
Mol. Mass.:70043.82
Organism:Homo sapiens (Human)
Description:n/a
Residue:641
BDBM32380
BDBM32369
NameBDBM32380
Synonyms:adenosine-derived inhibitor, 14
TypeSmall organic molecule
Emp. Form.C24H21Cl2F3N6O4
Mol. Mass.585.363
SMILESNc1ncnc2n([C@@H]3O[C@H](COCc4cc(F)c(F)c(F)c4)[C@@H](O)[C@H]3O)c(NCc3ccc(Cl)c(Cl)c3)nc12