Reaction Details
TargetBaculoviral IAP repeat-containing protein 3 [255-322]
LigandBDBM32576
Substrate/CompetitorBDBM17342
Meas. Tech.Fluorescence Polarization Affinity Measurements
pH7.2±n/a
Temperature295.15±n/a K
Ki 96±n/a nM
Citation Ndubaku, CVarfolomeev, EWang, LZobel, KLau, KElliott, LOMaurer, BFedorova, AVDynek, JNKoehler, MHymowitz, SGTsui, VDeshayes, KFairbrother, WJFlygare, JAVucic, D Antagonism of c-IAP and XIAP proteins is required for efficient induction of cell death by small-molecule IAP antagonists. ACS Chem Biol4:557-66 (2009) 
 
Baculoviral IAP repeat-containing protein 3 [255-322]
Name:Baculoviral IAP repeat-containing protein 3 [255-322]
Type:BIR3 domain
Mol. Mass.:7852.71
Organism:Homo sapiens (Human)
Description:Q13489[255-322]
Residue:68
BDBM32576
BDBM17342
NameBDBM32576
Synonyms:PS-1
TypeSmall organic molecule
Emp. Form.C27H32ClN5O3S
Mol. Mass.542.093
SMILESCN[C@@H](C)C(=O)N[C@@H](C1CCOCC1)C(=O)N1CCC[C@H]1c1nc2c(nccc2s1)-c1ccccc1Cl