Reaction Details
TargetCarbonic anhydrase 1
LigandBDBM33280
Substrate/CompetitorBDBM10856
Meas. Tech.CA Inhibition Assay
pH7.5±n/a
Temperature296.15±n/a K
Ki 530±n/a nM
Citation Vitale, RMAlterio, VInnocenti, AWinum, JYMonti, SMDe Simone, GSupuran, CT Carbonic anhydrase inhibitors. Comparison of aliphatic sulfamate/bis-sulfamate adducts with isozymes II and IX as a platform for designing tight-binding, more isoform-selective inhibitors. J Med Chem52:5990-8 (2009) 
 
Carbonic anhydrase 1
Name:Carbonic anhydrase 1
Type:Enzyme
Mol. Mass.:28873.37
Organism:Homo sapiens (Human)
Description:P00915
Residue:261
BDBM33280
BDBM10856
NameBDBM33280
Synonyms:CHEMBL153094 | aliphatic sulfamate, 2
TypeSmall organic molecule
Emp. Form.C10H23NO3S
Mol. Mass.237.36
SMILESCCCCCCCCCCOS(N)(=O)=O