Reaction Details
TargetCarbonic anhydrase 5A, mitochondrial
LigandBDBM33282
Substrate/CompetitorBDBM10856
Meas. Tech.CA Inhibition Assay
pH7.5±n/a
Temperature296.15±n/a K
Ki 1368±n/a nM
Citation Vitale, RMAlterio, VInnocenti, AWinum, JYMonti, SMDe Simone, GSupuran, CT Carbonic anhydrase inhibitors. Comparison of aliphatic sulfamate/bis-sulfamate adducts with isozymes II and IX as a platform for designing tight-binding, more isoform-selective inhibitors. J Med Chem52:5990-8 (2009) 
 
Carbonic anhydrase 5A, mitochondrial
Name:Carbonic anhydrase 5A, mitochondrial
Type:Enzyme
Mol. Mass.:34755.54
Organism:Homo sapiens (Human)
Description:Human (cloned) isozyme
Residue:305
BDBM33282
BDBM10856
NameBDBM33282
Synonyms:CHEMBL171476 | bis-sulfamate, 4
TypeSmall organic molecule
Emp. Form.C10H24N2O6S2
Mol. Mass.332.437
SMILESNS(=O)(=O)OCCCCCCCCCCOS(N)(=O)=O