Reaction Details
TargetCarbonic anhydrase 5B, mitochondrial
LigandBDBM33282
Substrate/CompetitorBDBM10856
Meas. Tech.CA Inhibition Assay
Ki 1592±n/a nM
Citation Vitale, RMAlterio, VInnocenti, AWinum, JYMonti, SMDe Simone, GSupuran, CT Carbonic anhydrase inhibitors. Comparison of aliphatic sulfamate/bis-sulfamate adducts with isozymes II and IX as a platform for designing tight-binding, more isoform-selective inhibitors. J Med Chem52:5990-8 (2009) 
 
Carbonic anhydrase 5B, mitochondrial
Name:Carbonic anhydrase 5B, mitochondrial
Type:Enzyme
Mol. Mass.:36440.83
Organism:Homo sapiens (Human)
Description:Human (cloned) isozyme
Residue:317
BDBM33282
BDBM10856
NameBDBM33282
Synonyms:CHEMBL171476 | bis-sulfamate, 4
TypeSmall organic molecule
Emp. Form.C10H24N2O6S2
Mol. Mass.332.437
SMILESNS(=O)(=O)OCCCCCCCCCCOS(N)(=O)=O