Reaction Details
TargetPeroxisome proliferator-activated receptor alpha
LigandBDBM28681
Substrate/CompetitorBDBM33283
Meas. Tech.Scintillation Proximity Assay (IC50) and PPAR alpha Transactivation Assay (EC50)
pH7.2±n/a
Temperature288.15±n/a K
EC50>12000±n/a nM
Comments21% inhibition @ 10 uM.Efficacy=23% (The maximum efficacy of GW9578 was defined as 100%).
Citation Casimiro-Garcia, ABigge, CFDavis, JAPadalino, TPulaski, JOhren, JFMcConnell, PKane, CDRoyer, LJStevens, KAAuerbach, BCollard, WMcGregor, CSong, K Synthesis and evaluation of novel alpha-heteroaryl-phenylpropanoic acid derivatives as PPARalpha/gamma dual agonists. Bioorg Med Chem17:7113-25 (2009) 
 
Peroxisome proliferator-activated receptor alpha
Name:Peroxisome proliferator-activated receptor alpha
Type:Enzyme
Mol. Mass.:52222.08
Organism:Homo sapiens (Human)
Description:Q07869
Residue:468
BDBM28681
BDBM33283
NameBDBM28681
Synonyms:5-[(4-{2-[methyl(pyridin-2-yl)amino]ethoxy}phenyl)methyl]-1,3-thiazolidine-2,4-dione BRL 49653 CHEMBL121 [3H]rosiglitazone rosiglitazone
Typeradiolabeled ligand
Emp. Form.C18H19N3O3S
Mol. Mass.357.427
SMILESCN(CCOc1ccc(Cc2sc(=O)[nH]c2O)cc1)c1ccccn1