Reaction Details
TargetBifunctional dihydrofolate reductase-thymidylate synthase
LigandBDBM33397
Substrate/CompetitorBDBM18044
IC50 7500±n/a nM
Citation Gangjee, ALi, WLin, LZeng, YIhnat, MWarnke, LAGreen, DWCody, VPace, JQueener, SF Design, synthesis, and X-ray crystal structures of 2,4-diaminofuro[2,3-d]pyrimidines as multireceptor tyrosine kinase and dihydrofolate reductase inhibitors. Bioorg Med Chem17:7324-36 (2009) 
 
Bifunctional dihydrofolate reductase-thymidylate synthase
Name:Bifunctional dihydrofolate reductase-thymidylate synthase
Type:Enzyme
Mol. Mass.:68757.49
Organism:Toxoplasma gondii
Description:Q07422
Residue:610
BDBM33397
BDBM18044
NameBDBM33397
Synonyms:2,4-diaminofuro[2,3-d]pyrimidine, 3 | E/Z ratio=3:1
TypeSmall organic molecule
Emp. Form.C18H20N4O2
Mol. Mass.324.377
SMILESCOc1ccccc1\C(=C/c1coc2nc(N)nc(N)c12)C(C)C