Reaction Details
TargetBifunctional dihydrofolate reductase-thymidylate synthase
LigandBDBM33406
Substrate/CompetitorBDBM18044
IC50 22200±n/a nM
Citation Gangjee, ALi, WLin, LZeng, YIhnat, MWarnke, LAGreen, DWCody, VPace, JQueener, SF Design, synthesis, and X-ray crystal structures of 2,4-diaminofuro[2,3-d]pyrimidines as multireceptor tyrosine kinase and dihydrofolate reductase inhibitors. Bioorg Med Chem17:7324-36 (2009) 
 
Bifunctional dihydrofolate reductase-thymidylate synthase
Name:Bifunctional dihydrofolate reductase-thymidylate synthase
Type:Enzyme
Mol. Mass.:68757.49
Organism:Toxoplasma gondii
Description:Q07422
Residue:610
BDBM33406
BDBM18044
NameBDBM33406
Synonyms:2,4-diaminofuro[2,3-d]pyrimidine, 12
TypeSmall organic molecule
Emp. Form.C19H24N4O2
Mol. Mass.340.4195
SMILESCOc1ccccc1C(CC(C)C)Cc1coc2nc(N)nc(N)c12