Reaction Details
TargetDihydrofolate reductase
LigandBDBM33399
Substrate/CompetitorBDBM18044
Meas. Tech.Phosphotyrosine (PY) ELISA
IC50 25900±n/a nM
Citation Gangjee, ALi, WLin, LZeng, YIhnat, MWarnke, LAGreen, DWCody, VPace, JQueener, SF Design, synthesis, and X-ray crystal structures of 2,4-diaminofuro[2,3-d]pyrimidines as multireceptor tyrosine kinase and dihydrofolate reductase inhibitors. Bioorg Med Chem17:7324-36 (2009) 
 
Dihydrofolate reductase
Name:Dihydrofolate reductase
Type:Enzyme
Mol. Mass.:23891.29
Organism:Pneumocystis carinii
Description:n/a
Residue:206
BDBM33399
BDBM18044
NameBDBM33399
Synonyms:2,4-diaminofuro[2,3-d]pyrimidine, 5 | E/Z ratio=3:2
TypeSmall organic molecule
Emp. Form.C19H22N4O2
Mol. Mass.338.4036
SMILESCCCC\C(=C\c1coc2nc(N)nc(N)c12)c1ccccc1OC