Reaction Details
TargetDihydrofolate reductase
LigandBDBM33405
Substrate/CompetitorBDBM18044
Meas. Tech.Phosphotyrosine (PY) ELISA
IC50 30900±n/a nM
Citation Gangjee, ALi, WLin, LZeng, YIhnat, MWarnke, LAGreen, DWCody, VPace, JQueener, SF Design, synthesis, and X-ray crystal structures of 2,4-diaminofuro[2,3-d]pyrimidines as multireceptor tyrosine kinase and dihydrofolate reductase inhibitors. Bioorg Med Chem17:7324-36 (2009) 
 
Dihydrofolate reductase
Name:Dihydrofolate reductase
Type:Enzyme
Mol. Mass.:23891.29
Organism:Pneumocystis carinii
Description:n/a
Residue:206
BDBM33405
BDBM18044
NameBDBM33405
Synonyms:2,4-diaminofuro[2,3-d]pyrimidine, 11
TypeSmall organic molecule
Emp. Form.C19H24N4O2
Mol. Mass.340.4195
SMILESCCCCC(Cc1coc2nc(N)nc(N)c12)c1ccccc1OC