Reaction Details
TargetAmine oxidase [flavin-containing] B
LigandBDBM256482
Substrate/Competitorn/a
Meas. Tech.Monoamine Oxidase Assays for Determining the Selectivity of the Compounds of the Invention for LSD1
IC50 5010±n/a nM
Citation Ortega Muñoz, AFyfe, MCMartinell Pedemonte, MEstiarte Martinez, MValls Vidal, NKurz, GCastro Palomino Laria, JC (Hetero)aryl cyclopropylamine compounds as LSD1 inhibitors US Patent US10329256 Publication Date 6/25/2019
 
Amine oxidase [flavin-containing] B
Name:Amine oxidase [flavin-containing] B
Type:Protein
Mol. Mass.:58768.76
Organism:Homo sapiens (Human)
Description:P27338
Residue:520
BDBM256482
NameBDBM256482
Synonyms:US10329256, Example 27 US9944601, Example 27
TypeSmall organic molecule
Emp. Form.C22H27FN2O
Mol. Mass.354.461
SMILESFc1ccccc1COc1ccc(cc1)[C@H]1C[C@@H]1NCC1CCNCC1