Reaction Details
TargetLysine-specific histone demethylase 1A
LigandBDBM256482
Substrate/Competitorn/a
Meas. Tech.Inhibition of LSD1
IC50 8.00±n/a nM
Citation Ortega Muñoz, AFyfe, MCMartinell Pedemonte, MEstiarte Martinez, MValls Vidal, NKurz, GCastro Palomino Laria, JC (Hetero)aryl cyclopropylamine compounds as LSD1 inhibitors US Patent US10329256 Publication Date 6/25/2019
 
Lysine-specific histone demethylase 1A
Name:Lysine-specific histone demethylase 1A
Type:Enzyme
Mol. Mass.:92901.01
Organism:Homo sapiens (Human)
Description:O60341
Residue:852
BDBM256482
NameBDBM256482
Synonyms:US10329256, Example 27 US9944601, Example 27
TypeSmall organic molecule
Emp. Form.C22H27FN2O
Mol. Mass.354.461
SMILESFc1ccccc1COc1ccc(cc1)[C@H]1C[C@@H]1NCC1CCNCC1