Reaction Details
TargetGlycogen phosphorylase, muscle form
LigandBDBM34110
Substrate/CompetitorBDBM23188
Meas. Tech.Enzyme Inhibition Assay
pH6.8±n/a
Temperature303.15±n/a K
Ki 630±20 nM
Citation Benltifa, MHayes, JMVidal, SGueyrard, DGoekjian, PGPraly, JPKizilis, GTiraidis, CAlexacou, KMChrysina, EDZographos, SELeonidas, DDArchontis, GOikonomakos, NG Glucose-based spiro-isoxazolines: a new family of potent glycogen phosphorylase inhibitors. Bioorg Med Chem17:7368-80 (2009) 
 
Glycogen phosphorylase, muscle form
Name:Glycogen phosphorylase, muscle form
Type:Enzyme
Mol. Mass.:97296.32
Organism:Oryctolagus cuniculus (rabbit)
Description:Phosphorylation of Ser-15 converts phosphorylase B (unphosphorylated) to phosphorylase A.
Residue:843
BDBM34110
BDBM23188
NameBDBM34110
Synonyms:glucopyranosylidene-spiro-isoxazoline, 4e
TypeSmall organic molecule
Emp. Form.C18H19NO6
Mol. Mass.345.3466
SMILESOC[C@H]1O[C@@]2(CC(=NO2)c2ccc3ccccc3c2)[C@H](O)[C@@H](O)[C@@H]1O