Reaction Details
Target5-hydroxytryptamine receptor 6
LigandBDBM21358
Substrate/CompetitorBDBM21342
Meas. Tech.5-HT6 Binding Assay
pH7.4±n/a
Temperature310.15±n/a K
Ki 2±n/a nM
EC50 6.5±n/a nM
Commentsagonist.
Citation Alcalde, EMesquida, NLópez-Pérez, SFrigola, JMercè, RHolenz, JPujol, MHernández, E Indene-based frameworks targeting the 5-HT6 serotonin receptor: ring constraint in indenylsulfonamides using cyclic amines and structurally abbreviated counterparts. Bioorg Med Chem17:7387-97 (2009) 
 
5-hydroxytryptamine receptor 6
Name:5-hydroxytryptamine receptor 6
Type:G Protein-Coupled Receptor (GPCR)
Mol. Mass.:46968.43
Organism:Homo sapiens (Human)
Description:P50406
Residue:440
BDBM21358
BDBM21342
NameBDBM21358
Synonyms:2-[1-({6-chloroimidazo[2,1-b][1,3]thiazole-5-}sulfonyl)-1H-indol-3-yl]ethan-1-amine SAX-187 | WAY-181187
TypeSmall organic molecule
Emp. Form.C15H13ClN4O2S2
Mol. Mass.380.872
SMILESNCCc1cn(c2ccccc12)S(=O)(=O)c1c(Cl)nc2sccn12