Reaction Details
Target5-hydroxytryptamine receptor 6
LigandBDBM34144
Substrate/CompetitorBDBM21342
Meas. Tech.5-HT6 Binding Assay
pH7.4±n/a
Temperature310.15±n/a K
Ki 1±n/a nM
EC50 0.4±n/a nM
Commentsagonist.
Citation Alcalde, EMesquida, NLópez-Pérez, SFrigola, JMercè, RHolenz, JPujol, MHernández, E Indene-based frameworks targeting the 5-HT6 serotonin receptor: ring constraint in indenylsulfonamides using cyclic amines and structurally abbreviated counterparts. Bioorg Med Chem17:7387-97 (2009) 
 
5-hydroxytryptamine receptor 6
Name:5-hydroxytryptamine receptor 6
Type:G Protein-Coupled Receptor (GPCR)
Mol. Mass.:46968.43
Organism:Homo sapiens (Human)
Description:P50406
Residue:440
BDBM34144
BDBM21342
NameBDBM34144
Synonyms:(R)-5a | WAY-466
TypeSmall organic molecule
Emp. Form.C19H20IN3O2S
Mol. Mass.481.35
SMILES[H][C@]1(Cc2c[nH]c3ccc(NS(=O)(=O)c4ccccc4I)cc23)CCCN1