Reaction Details
TargetCytoplasmic tyrosine-protein kinase BMX
LigandBDBM50245587
Substrate/Competitorn/a
Meas. Tech.In vitro Kinase Assay
IC50 6.73±n/a nM
Citation Gray, NBalk, SLiu, QChen, S Bone marrow on X chromosome kinase (BMX) inhibitors and uses thereof US Patent US10000483 Publication Date 6/19/2018
 
Cytoplasmic tyrosine-protein kinase BMX
Name:Cytoplasmic tyrosine-protein kinase BMX
Type:Tyrosine-protein kinase
Mol. Mass.:78030.42
Organism:Homo sapiens (Human)
Description:P51813
Residue:675
BDBM50245587
NameBDBM50245587
Synonyms:CHEMBL4077064 | US10000483, Compound II-4
TypeSmall organic molecule
Emp. Form.C27H21N5O2
Mol. Mass.447.4879
SMILESCn1cc(cn1)-c1ccc2ncc3ccc(=O)n(-c4ccc5CCN(C(=O)C=C)c5c4)c3c2c1