Reaction Details
TargetTyrosine-protein kinase Mer
LigandBDBM350844
Substrate/Competitorn/a
Meas. Tech.Inhibition Assay
IC50 0.720±n/a nM
Citation Wang, XZhang, WFrye, S Therapeutic uses of selected pyrrolopyrimidine compounds with anti-mer tyrosine kinase activity US Patent US10004755 Publication Date 6/26/2018
 
Tyrosine-protein kinase Mer
Name:Tyrosine-protein kinase Mer
Type:PROTEIN
Mol. Mass.:110234.77
Organism:Homo sapiens (Human)
Description:ChEMBL_1498723
Residue:999
BDBM350844
NameBDBM350844
Synonyms:UNC1972A US9795606, B3
TypeSmall organic molecule
Emp. Form.C26H36N6O3S
Mol. Mass.512.667
SMILESCCCCNc1ncc2c(cn(C3CC[C@H](N)CC3)c2n1)-c1ccc(cc1)S(=O)(=O)N1CCOCC1