Reaction Details
TargetTyrosine-protein kinase Mer
LigandBDBM50055498
Substrate/Competitorn/a
Meas. Tech.Inhibition Assay
IC50 0.570±n/a nM
Citation Wang, XZhang, WFrye, S Therapeutic uses of selected pyrrolopyrimidine compounds with anti-mer tyrosine kinase activity US Patent US10004755 Publication Date 6/26/2018
 
Tyrosine-protein kinase Mer
Name:Tyrosine-protein kinase Mer
Type:PROTEIN
Mol. Mass.:110234.77
Organism:Homo sapiens (Human)
Description:ChEMBL_1498723
Residue:999
BDBM50055498
NameBDBM50055498
Synonyms:CHEMBL3326004 US9795606, B28
TypeSmall organic molecule
Emp. Form.C27H37FN6O3S
Mol. Mass.544.684
SMILESCCCCNc1ncc2c(cn([C@H]3CC[C@H](O)CC3)c2n1)-c1ccc(c(F)c1)S(=O)(=O)N1CCN(C)CC1