Reaction Details
TargetSodium-dependent noradrenaline transporter
LigandBDBM35243
Substrate/CompetitorBDBM22417
Meas. Tech.Radioligand Binding Assay (Ki) and Norepinephrine Uptake Assay (IC50)
pH7.4±n/a
Temperature310.15±n/a K
Ki 487±27 nM
IC50 302±112 nM
Citation Heffernan, GDCoghlan, RDManas, ESMcDevitt, RELi, YMahaney, PERobichaud, AJHuselton, CAlfinito, PBray, JACosmi, SAJohnston, GHKenney, TKoury, EWinneker, RCDeecher, DCTrybulski, EJ Dual acting norepinephrine reuptake inhibitors and 5-HT(2A) receptor antagonists: Identification, synthesis and activity of novel 4-aminoethyl-3-(phenylsulfonyl)-1H-indoles. Bioorg Med Chem17:7802-15 (2009) 
 
Sodium-dependent noradrenaline transporter
Name:Sodium-dependent noradrenaline transporter
Type:Multi-pass membrane protein
Mol. Mass.:69337.72
Organism:Homo sapiens (Human)
Description:P23975
Residue:617
BDBM35243
BDBM22417
NameBDBM35243
Synonyms:3-(phenylsulfonyl)-1H-indole, 18e
TypeSmall organic molecule
Emp. Form.C19H22N2O2S
Mol. Mass.342.455
SMILESCCCNCCc1cccc2[nH]cc(c12)S(=O)(=O)c1ccccc1