Reaction Details
TargetSodium-dependent noradrenaline transporter
LigandBDBM35251
Substrate/CompetitorBDBM22417
Meas. Tech.Radioligand Binding Assay (Ki) and Norepinephrine Uptake Assay (IC50)
pH7.4±n/a
Temperature310.15±n/a K
Ki 21±9 nM
IC50 29±1 nM
Citation Heffernan, GDCoghlan, RDManas, ESMcDevitt, RELi, YMahaney, PERobichaud, AJHuselton, CAlfinito, PBray, JACosmi, SAJohnston, GHKenney, TKoury, EWinneker, RCDeecher, DCTrybulski, EJ Dual acting norepinephrine reuptake inhibitors and 5-HT(2A) receptor antagonists: Identification, synthesis and activity of novel 4-aminoethyl-3-(phenylsulfonyl)-1H-indoles. Bioorg Med Chem17:7802-15 (2009) 
 
Sodium-dependent noradrenaline transporter
Name:Sodium-dependent noradrenaline transporter
Type:Multi-pass membrane protein
Mol. Mass.:69337.72
Organism:Homo sapiens (Human)
Description:P23975
Residue:617
BDBM35251
BDBM22417
NameBDBM35251
Synonyms:3-(phenylsulfonyl)-1H-indole, 33a
TypeSmall organic molecule
Emp. Form.C20H24N2O2S
Mol. Mass.356.482
SMILESCCN(C)CCCc1cccc2[nH]cc(c12)S(=O)(=O)c1ccccc1