Reaction Details
TargetCarbonic anhydrase 2
LigandBDBM35730
Substrate/CompetitorBDBM10856
Meas. Tech.CA Inhibition Assay
pH7.4±n/a
Temperature298.15±n/a K
Ki 52±n/a nM
Citation Güzel, OInnocenti, AScozzafava, ASalman, ASupuran, CT Carbonic anhydrase inhibitors. Aromatic/heterocyclic sulfonamides incorporating phenacetyl, pyridylacetyl and thienylacetyl tails act as potent inhibitors of human mitochondrial isoforms VA and VB. Bioorg Med Chem17:4894-9 (2009) 
 
Carbonic anhydrase 2
Name:Carbonic anhydrase 2
Type:Enzyme
Mol. Mass.:29250.71
Organism:Homo sapiens (Human)
Description:P00918
Residue:260
BDBM35730
BDBM10856
NameBDBM35730
Synonyms:cid_694792 | sulfonamide deriv., 5e
TypeSmall organic molecule
Emp. Form.C13H14N2O3S2
Mol. Mass.310.392
SMILESNS(=O)(=O)c1ccc(CNC(=O)Cc2cccs2)cc1