Reaction Details
TargetBeta-secretase 2
LigandBDBM402431
Substrate/Competitorn/a
Meas. Tech.BACE-2 Assay
Ki 0.500±n/a nM
Citation Scott, JDBlizzard, TAWalsh, SPCumming, JN C5-C6-carbocyclic fused iminothiadiazine dioxides as BACE inhibitors, compositions, and their use US Patent US10329291 Publication Date 6/25/2019
 
Beta-secretase 2
Name:Beta-secretase 2
Type:Protein
Mol. Mass.:56171.20
Organism:Homo sapiens (Human)
Description:Q9Y5Z0
Residue:518
BDBM402431
NameBDBM402431
Synonyms:US10329291, Example 22
TypeSmall organic molecule
Emp. Form.C21H20BrFN6O2S
Mol. Mass.519.39
SMILESCN1C(=N)N[C@]2(CCC[C@H]2S1(=O)=O)c1cc(Nc2nccc3cc(Br)cnc23)ccc1F