Reaction Details
TargetTGF-beta receptor type-1
LigandBDBM35941
Substrate/CompetitorBDBM35940
Meas. Tech.Enzyme Compound Activity (IC50) and Cell Compound Activity (IC50/EC50)
pH7.4±n/a
Temperature296.15±n/a K
IC50 13±n/a nM
EC50 20±n/a nM
Citation Goldberg, FWWard, RAPowell, SJDebreczeni, JENorman, RARoberts, NJDishington, APGingell, HJWickson, KFRoberts, AL Rapid generation of a high quality lead for transforming growth factor-beta (TGF-beta) type I receptor (ALK5). J Med Chem52:7901-5 (2009) 
 
TGF-beta receptor type-1
Name:TGF-beta receptor type-1
Type:enzyme
Mol. Mass.:55968.24
Organism:Homo sapiens (Human)
Description:P36897
Residue:503
BDBM35941
BDBM35940
NameBDBM35941
Synonyms:4-pyridinoxy-2-anilinopyridine-based compound, 5
TypeSmall organic molecule
Emp. Form.C25H24N4O4
Mol. Mass.444.4825
SMILESCOc1cc(Nc2cc(Oc3ccc(C)nc3-c3ccccn3)ccn2)cc(OC)c1OC