Reaction Details
TargetKinesin-like protein KIF11
LigandBDBM50220156
Substrate/Competitorn/a
Meas. Tech.Wild-type IC95 biaryl selected
pH6.8±0
IC50 1.0±0.0 nM
Citation Luo, LParrish, CANevins, NMcNulty, DEChaudhari, AMCarson, JDSudakin, VShaw, ANLehr, RZhao, HSweitzer, SLad, LWood, KWSakowicz, RAnnan, RSHuang, PSJackson, JRDhanak, DCopeland, RAAuger, KR ATP-competitive inhibitors of the mitotic kinesin KSP that function via an allosteric mechanism. Nat Chem Biol3:722-6 (2007) 
 
Kinesin-like protein KIF11
Name:Kinesin-like protein KIF11
Type:PROTEIN
Mol. Mass.:119138.97
Organism:Homo sapiens (Human)
Description:ChEMBL_1457426
Residue:1056
BDBM50220156
NameBDBM50220156
Synonyms:(R)-N-(3-aminopropyl)-N-(1-(3-benzyl-7-chloro-4-oxo-3,4-dihydroquinazolin-2-yl)-2-methylpropyl)-3-fluoro-4-methylbenzamide SB-731489
TypeSmall organic molecule
Emp. Form.C30H32ClFN4O2
Mol. Mass.535.052
SMILESCC(C)[C@@H](N(CCCN)C(=O)c1ccc(C)c(F)c1)c1nc2cc(Cl)ccc2c(=O)n1Cc1ccccc1