Reaction Details
TargetPhospholipase D1
LigandBDBM50206160
Substrate/Competitorn/a
Meas. Tech.d.311 Enzymatic Inhibition Assay
Temperature310.15±0 K
IC50 11±0.0 nM
Citation Scott, SASelvy, PEBuck, JRCho, HPCriswell, TLThomas, ALArmstrong, MDArteaga, CLLindsley, CWBrown, HA Design of isoform-selective phospholipase D inhibitors that modulate cancer cell invasiveness. Nat Chem Biol5:108-17 (2009) 
 
Phospholipase D1
Name:Phospholipase D1
Type:Protein
Mol. Mass.:124219.92
Organism:Homo sapiens (Human)
Description:Q13393
Residue:1074
BDBM50206160
NameBDBM50206160
Synonyms:CHEMBL245621 Halopemide, 8 N-(2-(4-(5-chloro-2-oxo-2,3-dihydrobenzo[d]imidazol-1-yl)piperidin-1-yl)ethyl)-4-fluorobenzamide | cid_65490
TypeSmall organic molecule
Emp. Form.C21H22ClFN4O2
Mol. Mass.416.876
SMILESFc1ccc(cc1)C(=O)NCCN1CCC(CC1)n1c2ccc(Cl)cc2[nH]c1=O