Reaction Details
TargetBeta-lactamase
LigandBDBM36440
Substrate/Competitorn/a
Meas. Tech.Beta-lactamase AmpC Inhibition Assay
pH7±0
Ki 2200000±0.0 nM
Citation Chen, YShoichet, BK Molecular docking and ligand specificity in fragment-based inhibitor discovery. Nat Chem Biol5:358-64 (2009) 
 
Beta-lactamase
Name:Beta-lactamase
Type:Protien
Mol. Mass.:41561.62
Organism:Escherichia coli
Description:P00811
Residue:377
BDBM36440
NameBDBM36440
Synonyms:CID25181259 | ZINC13785333, 4
TypeSmall organic molecule
Emp. Form.C12H14NO4
Mol. Mass.236.2444
SMILESC[C@H](N1C(=O)C2C3CCC(C3)C2C1=O)C([O-])=O