Reaction Details
TargetProto-oncogene tyrosine-protein kinase Src
LigandBDBM13216
Substrate/Competitorn/a
Meas. Tech.Tyrosine Kinase Inhibition Assay
IC50 0.4± 0.2 nM
Kd 11± 3 nM
Citation Simard, JRKlüter, SGrütter, CGetlik, MRabiller, MRode, HBRauh, D A new screening assay for allosteric inhibitors of cSrc. Nat Chem Biol5:394-6 (2009) 
 
Proto-oncogene tyrosine-protein kinase Src
Name:Proto-oncogene tyrosine-protein kinase Src
Type:Tyr protein kinase
Mol. Mass.:60015.36
Organism:Gallus gallus (Chicken)
Description:P00523
Residue:533
BDBM13216
NameBDBM13216
Synonyms:BMS-354825 DASATINIB N-(2-chloro-6-methylphenyl)-2-({6-[4-(2-hydroxyethyl)piperazin-1-yl]-2-methylpyrimidin-4-yl}amino)-1,3-thiazole-5-carboxamide US20230348453, Compound A8 med.21724, Compound Dasatinib
TypeSmall organic molecule
Emp. Form.C22H26ClN7O2S
Mol. Mass.488.006
SMILESCc1nc(Nc2ncc(s2)C(=O)Nc2c(C)cccc2Cl)cc(n1)N1CCN(CCO)CC1