Reaction Details
TargetHistone deacetylase 5
LigandBDBM36483
Substrate/Competitorn/a
Meas. Tech.HDAC Enzyme Activity Assay
pH7.4±0
Temperature273.15±n/a K
IC50 3040±n/a nM
Citation Bradner, JEWest, NGrachan, MLGreenberg, EFHaggarty, SJWarnow, TMazitschek, R Chemical phylogenetics of histone deacetylases. Nat Chem Biol6:238-243 (2010) 
 
Histone deacetylase 5
Name:Histone deacetylase 5
Type:Enzyme
Mol. Mass.:121968.61
Organism:Homo sapiens (Human)
Description:Q9UQL6
Residue:1122
BDBM36483
NameBDBM36483
Synonyms:(S)-6-acetamido-2-(2-((S)-2-acetamido-4-methylpentanamido)acetamido)-N-(4-methyl-2-oxo-2H-chromen-7-yl)hexanamide, 3 | CID10460379
TypeSmall organic molecule
Emp. Form.C28H39N5O7
Mol. Mass.557.6386
SMILESCC(C)C[C@H](NC(C)=O)C(=O)NCC(=O)N[C@@H](CCCCNC(C)=O)C(=O)Nc1ccc2c(C)cc(=O)oc2c1