Reaction Details
Target5'-methylthioadenosine/S-adenosylhomocysteine nucleosidase
LigandBDBM36498
Substrate/CompetitorBDBM22111
Meas. Tech.Enzyme Activity Assay
pH7.5±0
Temperature298.15±0 K
Kd 0.500±0.0 nM
Citation Gutierrez, JALuo, MSingh, VLi, LBrown, RLNorris, GEEvans, GBFurneaux, RHTyler, PCPainter, GFLenz, DHSchramm, VL Picomolar inhibitors as transition-state probes of 5'-methylthioadenosine nucleosidases. ACS Chem Biol2:725-34 (2007) 
 
5'-methylthioadenosine/S-adenosylhomocysteine nucleosidase
Name:5'-methylthioadenosine/S-adenosylhomocysteine nucleosidase
Type:Enzyme
Mol. Mass.:24505.78
Organism:Klebsiella pneumoniae
Description:B5Y1L0
Residue:232
BDBM36498
BDBM22111
NameBDBM36498
Synonyms:DADMe-ImmA-p-ClPh
TypeSmall organic molecule
Emp. Form.C18H20ClN5OS
Mol. Mass.389.902
SMILESNc1ncnc2c(CN3CC(O)C(CSc4ccc(Cl)cc4)C3)c[nH]c12