Reaction Details
TargetHeat shock protein HSP 90-beta
LigandBDBM36527
Substrate/Competitorn/a
Meas. Tech.Fluorescence Polarization Assay
pH8±0
Kd 1000±0.0 nM
Citation Yi, FRegan, L A novel class of small molecule inhibitors of Hsp90. ACS Chem Biol3:645-54 (2008) 
 
Heat shock protein HSP 90-beta
Name:Heat shock protein HSP 90-beta
Type:Molecular Chaperone
Mol. Mass.:83229.45
Organism:Homo sapiens (Human)
Description:P08238
Residue:724
BDBM36527
NameBDBM36527
Synonyms:1,6-dimethyl-3-phenyl-1H,5H,6H,7H-pyrimido[5,4-e][1,2,4]triazine-5,7-dione, 10 | US9073941, 601
TypeSmall organic molecule
Emp. Form.C13H11N5O2
Mol. Mass.269.2587
SMILESCn1nc(nc2c1nc(=O)n(C)c2=O)-c1ccccc1