Reaction Details
TargetAcetylcholinesterase
LigandBDBM36552
Substrate/Competitorn/a
Meas. Tech.Enzyme Inhibition Assay
pH7.4±0
Temperature310.15±0 K
IC50 5.2e+2± 7e+1 nM
Citation Zheng, HYoudim, MBFridkin, M Site-activated chelators targeting acetylcholinesterase and monoamine oxidase for Alzheimer's therapy. ACS Chem Biol5:603-10 (2010) 
 
Acetylcholinesterase
Name:Acetylcholinesterase
Type:Enzyme
Mol. Mass.:68193.62
Organism:Rattus norvegicus (rat)
Description:P37136
Residue:614
BDBM36552
NameBDBM36552
Synonyms:Prochelators, 2
TypeSmall organic molecule
Emp. Form.C17H19N3O2
Mol. Mass.297.3517
SMILESCN(CC#C)Cc1ccc(OC(=O)N(C)C)c2ncccc12