Reaction Details
TargetMethionine aminopeptidase 2
LigandBDBM36588
Substrate/Competitorn/a
Meas. Tech.Proliferation Assay
pH7.5±0
EC50 0.037±0.0024 nM
Citation Griffith, ECSu, ZTurk, BEChen, SChang, YHWu, ZBiemann, KLiu, JO Methionine aminopeptidase (type 2) is the common target for angiogenesis inhibitors AGM-1470 and ovalicin. Chem Biol4:461-71 (1997) 
 
Methionine aminopeptidase 2
Name:Methionine aminopeptidase 2
Type:Enzyme
Mol. Mass.:52914.64
Organism:Mus musculus (Mouse)
Description:O08663
Residue:478
BDBM36588
NameBDBM36588
Synonyms:AGM-1470
TypeSmall organic molecule
Emp. Form.C19H28ClNO6
Mol. Mass.401.882
SMILES[#6]-[#8]-[#6@@H]-1-[#6@@H](-[#6]-[#6][C@]2([#6]-[#8]2)[#6]-1[C@]1([#6])[#8]-[#6]1-[#6]\[#6]=[#6](\[#6])-[#6])-[#8]-[#6](=O)-[#7]-[#6](=O)-[#6]Cl