Reaction Details
TargetcAMP-dependent protein kinase
LigandBDBM3207
Substrate/Competitorn/a
Meas. Tech.Inhibition Assay
pH7.5±0
Temperature303.15±0 K
Ki 3.9±0 nM
IC50 6.3±0.0 nM
Citation Koide, KBunnage, MEGomez Paloma, LKanter, JRTaylor, SSBrunton, LLNicolaou, KC Molecular design and biological activity of potent and selective protein kinase inhibitors related to balanol. Chem Biol2:601-8 (1995) 
 
cAMP-dependent protein kinase
Name:cAMP-dependent protein kinase
Type:Enzyme
Mol. Mass.:40766.33
Organism:Oryctolagus cuniculus (Rabbit)
Description:Q95J97
Residue:351
BDBM3207
NameBDBM3207
Synonyms:10''-Deoxybalanol, 4 4-trans-[4-(2-Carboxybenzoyl)-3,5-dihydroxybenzoyloxy]-3-(4-hydroxybenzamido)azepane Modified Benzophenone Ring, Balanol Analog 7
TypeSmall organic molecule
Emp. Form.C28H26N2O9
Mol. Mass.534.514
SMILESOC(=O)c1ccccc1C(=O)c1c(O)cc(cc1O)C(=O)O[C@@H]1CCCNC[C@H]1NC(=O)c1ccc(O)cc1