Reaction Details
TargetcAMP-dependent protein kinase
LigandBDBM36600
Substrate/Competitorn/a
Meas. Tech.Inhibition Assay
pH7.5±0
Temperature303.15±0 K
Ki>10e3±0 nM
Citation Koide, KBunnage, MEGomez Paloma, LKanter, JRTaylor, SSBrunton, LLNicolaou, KC Molecular design and biological activity of potent and selective protein kinase inhibitors related to balanol. Chem Biol2:601-8 (1995) 
 
cAMP-dependent protein kinase
Name:cAMP-dependent protein kinase
Type:Enzyme
Mol. Mass.:40766.33
Organism:Oryctolagus cuniculus (Rabbit)
Description:Q95J97
Residue:351
BDBM36600
NameBDBM36600
Synonyms:Benzophenone fragment, 2
TypeSmall organic molecule
Emp. Form.C16H12O8
Mol. Mass.332.2617
SMILESCOC(=O)c1cc(O)c(C(=O)c2c(O)cccc2C(O)=O)c(O)c1