Reaction Details
TargetThyroid hormone receptor beta
LigandBDBM50130595
Substrate/Competitorn/a
Meas. Tech.TR Receptor Ligand Binding Assay
Kd 9.8±1.7 nM
Citation Chiellini, GApriletti, JWYoshihara, HABaxter, JDRibeiro, RCScanlan, TS A high-affinity subtype-selective agonist ligand for the thyroid hormone receptor. Chem Biol5:299-306 (1998) 
 
Thyroid hormone receptor beta
Name:Thyroid hormone receptor beta
Type:Receptor
Mol. Mass.:52793.62
Organism:Homo sapiens (Human)
Description:Recombinant hThR was obtained from nuclear extracts from SF9 cells infected with baculovirus vectors encoding for ThRbeta 1.
Residue:461
BDBM50130595
NameBDBM50130595
Synonyms:2-Amino-3-[4-(4-hydroxy-3-isopropyl-phenoxy)-3,5-dimethyl-phenyl]-propionic acid Dimethyl-isopropyl-T3 (DIMIT)
TypeSmall organic molecule
Emp. Form.C20H25NO4
Mol. Mass.343.4168
SMILESCC(C)c1cc(Oc2c(C)cc(C[C@H](N)C(O)=O)cc2C)ccc1O